{"text_format":"1","workbook":"xlsx","n_sheets":25,"sheets":["Main Menu","Serviceability Calculator","NDI DTI Output","NDI DTI Output 2","NDI DTI Output 3","Introduction","SMSF Introduction","Lease Doc Intro","Non Res Introduction","HEM","Commercial Introduction","Commercial DTI Output","Commercial Calculator","Test Serviceability Calculator","SMSF Serviceability Calculator","SMSF DTI Output","Non-Res Serviceability","Non-res DTI Output","Lease Doc Serviceability Calc","Lease Doc DTI Output","Living Allow","Tax Scales","Definitions","Admin","RepayCalculator"],"not_rendered":{"charts":0,"images":10,"macros":1,"external_links":2,"defined_names":77,"comments":0,"pivot_tables":0},"unopened":[],"bounds":{"document_bytes":16777216,"sheet_cells":100000,"rows_first":2000,"rows_last":500,"rows_between":2000,"halvings":0,"cell_chars":16384,"cell_head_chars":4096},"cells_cut":0,"cells_raw":0,"read":"whole","date_system":"1900"}

{"sheet":"Main Menu","index":0,"n_rows":61,"n_cols":1,"rows_kept":61,"cut":false,"hidden":false,"merged":[[60,0,80,8]]}
[]
[]
[]
[]
[]
[]
[]
[]
[]
[]
{"$rows_left_out":52}
{"sheet":"Serviceability Calculator","index":1,"n_rows":154,"n_cols":11,"rows_kept":154,"cut":false,"hidden":true,"merged":[[93,10,94,11],[72,10,73,11],[74,10,75,11],[76,10,79,11],[5,2,5,7],[64,10,66,11],[70,10,71,11],[10,10,13,11],[91,10,92,11],[89,10,90,11]]}
[" "]
[]
[]
[null,null,null,null,null,"Date:",null,{"$f":"TODAY()","v":"2023-04-04"}]
["Prospector number:"]
["Applicants Name(s):",null,null,null,null,null,null,null,null,null,"Your clients name please"]
[]
[]
[]
["Household Status",null,"Household Number","Status","Dependents\n(only enter once for each household)"]
{"$rows_left_out":145}
{"sheet":"NDI DTI Output","index":2,"n_rows":32,"n_cols":2,"rows_kept":32,"cut":false,"hidden":true,"merged":[]}
["Prospector Number ",{"$f":"'Serviceability Calculator'!$C$128","v":0}]
["Serviceability calculator type","NDI"]
["Applicant 1 Normal Income",{"$f":"'Serviceability Calculator'!$C32+'Serviceability Calculator'!$D$32","v":0}]
["Applicant 2 Normal Income",{"$f":"'Serviceability Calculator'!$C33+'Serviceability Calculator'!$D$33","v":0}]
["Applicant 3 Normal Income",{"$f":"'Serviceability Calculator'!$C34+'Serviceability Calculator'!$D$34","v":0}]
["Applicant 4 Normal Income",{"$f":"SUM('Serviceability Calculator'!$C35:$C39)+SUM('Serviceability Calculator'!$D$35:$D39)","v":0}]
["Applicant 1 Rental Income",{"$f":"'Serviceability Calculator'!$E$32","v":0}]
["Applicant 2 Rental Income",{"$f":"'Serviceability Calculator'!$E$33","v":0}]
["Applicant 3 Rental Income",{"$f":"'Serviceability Calculator'!$E$34","v":0}]
["Applicant 4 Rental Income",{"$f":"SUM('Serviceability Calculator'!$E$35:$E$39)","v":0}]
{"$rows_left_out":23}
{"sheet":"NDI DTI Output 2","index":3,"n_rows":32,"n_cols":2,"rows_kept":32,"cut":false,"hidden":true,"merged":[]}
["Prospector Number ",{"$f":"'Serviceability Calculator'!$D$128","v":0}]
["Serviceability calculator type","NDI"]
["Applicant 1 Normal Income",{"$f":"'Serviceability Calculator'!$C32+'Serviceability Calculator'!$D$32","v":0}]
["Applicant 2 Normal Income",{"$f":"'Serviceability Calculator'!$C33+'Serviceability Calculator'!$D$33","v":0}]
["Applicant 3 Normal Income",{"$f":"'Serviceability Calculator'!$C34+'Serviceability Calculator'!$D$34","v":0}]
["Applicant 4 Normal Income",{"$f":"SUM('Serviceability Calculator'!$C35:$C39)+SUM('Serviceability Calculator'!$D$35:$D39)","v":0}]
["Applicant 1 Rental Income",{"$f":"'Serviceability Calculator'!$E$32","v":0}]
["Applicant 2 Rental Income",{"$f":"'Serviceability Calculator'!$E$33","v":0}]
["Applicant 3 Rental Income",{"$f":"'Serviceability Calculator'!$E$34","v":0}]
["Applicant 4 Rental Income",{"$f":"SUM('Serviceability Calculator'!$E$35:$E$39)","v":0}]
{"$rows_left_out":23}
{"sheet":"NDI DTI Output 3","index":4,"n_rows":32,"n_cols":2,"rows_kept":32,"cut":false,"hidden":true,"merged":[]}
["Prospector Number ",{"$f":"'Serviceability Calculator'!$E$128","v":0}]
["Serviceability calculator type","NDI"]
["Applicant 1 Normal Income",{"$f":"'Serviceability Calculator'!$C32+'Serviceability Calculator'!$D$32","v":0}]
["Applicant 2 Normal Income",{"$f":"'Serviceability Calculator'!$C33+'Serviceability Calculator'!$D$33","v":0}]
["Applicant 3 Normal Income",{"$f":"'Serviceability Calculator'!$C34+'Serviceability Calculator'!$D$34","v":0}]
["Applicant 4 Normal Income",{"$f":"SUM('Serviceability Calculator'!$C35:$C39)+SUM('Serviceability Calculator'!$D$35:$D39)","v":0}]
["Applicant 1 Rental Income",{"$f":"'Serviceability Calculator'!$E$32","v":0}]
["Applicant 2 Rental Income",{"$f":"'Serviceability Calculator'!$E$33","v":0}]
["Applicant 3 Rental Income",{"$f":"'Serviceability Calculator'!$E$34","v":0}]
["Applicant 4 Rental Income",{"$f":"SUM('Serviceability Calculator'!$E$35:$E$39)","v":0}]
{"$rows_left_out":23}
{"sheet":"Introduction","index":5,"n_rows":24,"n_cols":2,"rows_kept":24,"cut":false,"hidden":true,"merged":[[22,1,22,4],[23,1,26,4],[27,0,28,4],[4,0,7,4],[18,1,18,4],[21,1,21,4],[20,1,20,4],[19,1,19,4]]}
[]
[]
["Introduction"]
[]
["Welcome to La Trobe Financial's serviceability calculator. The Serviceability Calculator incorporates formulas to calculate clients incomes, living expenses, existing and new loan and other commitments and includes built in sensitivity for variance in interest rates.  Should your clients return negative Net Disposal Income (NDI) a figure encapsulated in brackets as the result, the proposal may still be referred to La Trobe for separate assessment."]
[]
[]
[]
[]
["Introduction"]
{"$rows_left_out":15}
{"sheet":"SMSF Introduction","index":6,"n_rows":25,"n_cols":2,"rows_kept":25,"cut":false,"hidden":true,"merged":[[25,0,26,4],[4,0,4,4],[14,0,14,4],[16,1,16,4],[17,1,17,4],[18,1,18,4],[19,1,19,4],[20,1,20,4],[21,1,21,4],[22,1,22,4],[24,1,24,4],[23,1,23,4]]}
[]
[]
["Introduction"]
[]
["Welcome to La Trobe Financial's SMSF serviceability calculator. The Serviceability Calculator assessed the serviceability of an SMSF loan and incorporates formulas to calculate clients SMSF contributions, SMSF income and rental income. The applicants personal income surplus may also be used to assess serviceability using income, ;living expenses, new and existing commitments and includes built in sensitivity for variance in interest rates.  Should your clients return negative Net Disposal Income (NDI) a figure encapsulated in brackets as the result, the proposal may still be referred to La Trobe for separate assessment."]
["Introduction"]
["There are three tabs within this worksheet:"]
[]
["Introduction (this sheet)"]
["Serviceability Calculator"]
{"$rows_left_out":16}
{"sheet":"Lease Doc Intro","index":7,"n_rows":35,"n_cols":2,"rows_kept":35,"cut":false,"hidden":true,"merged":[[27,0,28,4],[1,0,3,4],[5,0,8,4],[19,1,19,4],[21,1,22,4],[24,1,25,4],[26,1,26,4]]}
[]
["Welcome to La Trobe’s Lease Doc Calculator.  The Calculator has been developed utilising  current guidelines and attempts to provide a balanced assessment of a Lease Doc clients borrowing capacity."]
[]
[]
[]
["The Lease Doc calculator is available only for Commercial facilities and requires the rental return on an individual Commercial security to return a 120% debt coverage ratio over the particular asset.  Should your clients return a result greater than 1.20%, the proposal may proceed."]
[]
[]
[]
[]
{"$rows_left_out":26}
{"sheet":"Non Res Introduction","index":8,"n_rows":36,"n_cols":2,"rows_kept":36,"cut":false,"hidden":true,"merged":[[3,0,5,4],[30,1,30,4],[35,1,38,4],[39,0,40,4],[6,0,9,4],[20,1,20,4],[24,1,25,4],[27,1,29,4],[31,1,34,4],[22,1,22,4]]}
[]
[]
["Introduction"]
["Welcome to La Trobe’s Non-resident Serviceability Calculator.  The Calculator has been developed utilising  current guidelines and provides an assessment of non-resident clients borrowing capacity."]
[]
[]
["The Serviceability Calculator incorporates formulas to calculate clients Net Incomes, mortgage repayments and includes built in sensitivity for variance in interest rates to ensure clients can afford repayments on their loan obligations. "]
[]
[]
[]
{"$rows_left_out":27}
{"sheet":"HEM","index":9,"n_rows":99,"n_cols":16,"rows_kept":99,"cut":false,"hidden":true,"merged":[]}
[]
[]
[]
[null,null,null,"\"HEM Table 1\" equivalent: by Income Level and Residency"]
[null,null,null,null,null,"BASED ON PREDICTED VALUES FROM THE QUANTILE REGRESSIONS"]
[null,null,null,null,null,null,null,"Smoothed HEM"]
[null,"Column for lookup",2,3,4,5,6,7,8,9,10,11,12,13,14,15]
[null,null,null,null,null,"Total current gross HH income from all sources (measured in current dollars)"]
[null,null,-9999999999,24000,36000,48000,61000,73000,97000,121000,145000,170000,194000,242000,303000,363000]
[null,null,"or less","to","to","to","to","to","to","to","to","to","to","to","to","to"]
{"$rows_left_out":90}
{"sheet":"Commercial Introduction","index":10,"n_rows":21,"n_cols":2,"rows_kept":21,"cut":false,"hidden":true,"merged":[[12,1,12,4],[16,1,16,4],[17,1,17,4],[18,1,18,4],[20,1,23,4],[24,0,25,4],[14,1,14,4],[15,1,15,4],[13,1,13,4],[19,1,19,4]]}
[]
[]
["Introduction"]
[]
["There are three tabs within this worksheet:"]
[]
["Introduction (this sheet)"]
["Serviceability Calculator"]
["Definitions"]
[]
{"$rows_left_out":12}
{"sheet":"Commercial DTI Output","index":11,"n_rows":32,"n_cols":2,"rows_kept":32,"cut":false,"hidden":true,"merged":[]}
["Prospector Number ",{"$f":"'Commercial Calculator'!$C$11","v":0}]
["Serviceability calculator type","ICR"]
["Applicant 1 Normal Income",{"$f":"'Commercial Calculator'!$C65+'Commercial Calculator'!$D65","v":0}]
["Applicant 2 Normal Income",{"$f":"'Commercial Calculator'!$C66+'Commercial Calculator'!$D66","v":0}]
["Applicant 3 Normal Income",{"$f":"'Commercial Calculator'!$C67+'Commercial Calculator'!$D67","v":0}]
["Applicant 4 Normal Income",{"$f":"'Commercial Calculator'!$C68+'Commercial Calculator'!$D68","v":0}]
["Applicant 1 Rental Income",{"$f":"'Commercial Calculator'!$E65","v":0}]
["Applicant 2 Rental Income",{"$f":"'Commercial Calculator'!$E66","v":0}]
["Applicant 3 Rental Income",{"$f":"'Commercial Calculator'!$E67","v":0}]
["Applicant 4 Rental Income",{"$f":"'Commercial Calculator'!$E68","v":0}]
{"$rows_left_out":23}
{"sheet":"Commercial Calculator","index":12,"n_rows":108,"n_cols":8,"rows_kept":108,"cut":false,"hidden":true,"merged":[[11,2,11,4]]}
[]
[]
[]
[]
[]
[]
[]
[]
[]
[]
{"$rows_left_out":99}
{"sheet":"Test Serviceability Calculator","index":13,"n_rows":153,"n_cols":22,"rows_kept":153,"cut":false,"hidden":true,"merged":[[9,1,9,6]]}
[]
[]
[null,null,"INSERT BANNER"]
[]
[]
[]
[]
[]
["Prospector number"]
["Applicant Name"]
{"$rows_left_out":144}
{"sheet":"SMSF Serviceability Calculator","index":14,"n_rows":93008,"n_cols":10,"rows_kept":93008,"cut":false,"hidden":true,"merged":[[4,3,4,6]]}
[]
[]
[null,null,null,null,"Date:",null,{"$f":"TODAY()","v":"2023-04-04"}]
["Prospector number:"]
["Applicants Name(s):",null,null,null,null,null,null,null,null,"Your clients name please"]
[]
[null,null,null,"Number"]
["SMSF income and contributions  "]
["SMSF (Other Assets)",null,null,0]
["Income From Other Assets",null,null,{"$f":"D9*3.9%","v":0},{"$f":"D10/12","v":0},null,{"$f":"'Tax Scales'!$Y$98","v":0}]
{"$rows_left_out":92999}
{"sheet":"SMSF DTI Output","index":15,"n_rows":35,"n_cols":2,"rows_kept":35,"cut":false,"hidden":true,"merged":[]}
["Prospector Number ",{"$f":"'SMSF Serviceability Calculator'!D4","v":0}]
["Serviceability calculator type","SMSF"]
["Applicant 1 Normal Income",{"$f":"'SMSF Serviceability Calculator'!C58+'SMSF Serviceability Calculator'!D58","v":0}]
["Applicant 2 Normal Income",{"$f":"'SMSF Serviceability Calculator'!C59+'SMSF Serviceability Calculator'!D59","v":0}]
["Applicant 3 Normal Income",{"$f":"'SMSF Serviceability Calculator'!C60","v":0}]
["Applicant 4 Normal Income",{"$f":"'SMSF Serviceability Calculator'!C61","v":0}]
["Applicant 1 Rental Income",{"$f":"'SMSF Serviceability Calculator'!C65","v":0}]
["Applicant 2 Rental Income",{"$f":"'SMSF Serviceability Calculator'!C66","v":0}]
["Applicant 3 Rental Income",{"$f":"'SMSF Serviceability Calculator'!C67","v":0}]
["Applicant 4 Rental Income",{"$f":"'SMSF Serviceability Calculator'!C68","v":0}]
{"$rows_left_out":26}
{"sheet":"Non-Res Serviceability","index":16,"n_rows":110,"n_cols":14,"rows_kept":110,"cut":false,"hidden":true,"merged":[[98,13,98,15],[4,2,4,7],[65,13,71,15],[32,13,52,15],[57,13,60,15]]}
[]
[]
[null,null,null,null,null,null,null,null,"Date:",null,{"$f":"TODAY()","v":"2023-04-04"}]
["Prospector number:"]
["Applicants Name(s):",null,null,null,null,null,null,null,null,null,null,null,null,"Your clients name please"]
[]
["Country of Residence",null,"Singapore",null,null,null,null,null,null,null,null,null,null,"Your clients country of residence"]
["Foreign Currency",null,{"$f":"VLOOKUP(C7,'Living Allow'!$E$20:$G$96,3,FALSE)","v":"SGD"}]
["Foreign Currency Exchange Rate - www.xe.com ",null,0]
[]
{"$rows_left_out":101}
{"sheet":"Non-res DTI Output","index":17,"n_rows":32,"n_cols":2,"rows_kept":32,"cut":false,"hidden":true,"merged":[]}
["Prospector Number ",{"$f":"'Non-Res Serviceability'!C4","v":0}]
["Serviceability calculator type","NRL"]
["Applicant 1 Normal Income",{"$f":"('Non-Res Serviceability'!C32*'Non-Res Serviceability'!$C$9)+'Non-Res Serviceability'!H32","v":0}]
["Applicant 2 Normal Income",{"$f":"('Non-Res Serviceability'!C33*'Non-Res Serviceability'!$C$9)+'Non-Res Serviceability'!H33","v":0}]
["Applicant 3 Normal Income",{"$f":"('Non-Res Serviceability'!C34*'Non-Res Serviceability'!$C$9)+'Non-Res Serviceability'!H34","v":0}]
["Applicant 4 Normal Income",{"$f":"('Non-Res Serviceability'!C35*'Non-Res Serviceability'!$C$9)+'Non-Res Serviceability'!H35","v":0}]
["Applicant 1 Rental Income",{"$f":"('Non-Res Serviceability'!C47*'Non-Res Serviceability'!$C$9)+'Non-Res Serviceability'!H47","v":0}]
["Applicant 2 Rental Income",{"$f":"('Non-Res Serviceability'!C48*'Non-Res Serviceability'!$C$9)+'Non-Res Serviceability'!H48","v":0}]
["Applicant 3 Rental Income",{"$f":"('Non-Res Serviceability'!C49*'Non-Res Serviceability'!$C$9)+'Non-Res Serviceability'!H49","v":0}]
["Applicant 4 Rental Income",{"$f":"('Non-Res Serviceability'!C50*'Non-Res Serviceability'!$C$9)+'Non-Res Serviceability'!H50","v":0}]
{"$rows_left_out":23}
{"sheet":"Lease Doc Serviceability Calc","index":18,"n_rows":31,"n_cols":7,"rows_kept":31,"cut":false,"hidden":true,"merged":[[4,1,4,3]]}
[]
[]
[null,null,"Date:",{"$f":"TODAY()","v":"2023-04-04"}]
["Prospector number:"]
["Applicants Name(s):",null,null,null,null,null,"Your clients name please"]
[]
["New Loan Commitment"]
["Repayment Type",{"$f":"IF(B9=0,\"\",IF(B9>B10,\"Principal & Interest\",\"Interest Only\"))","v":""}]
["Loan Term",0]
["Interest Only Term",0]
{"$rows_left_out":22}
{"sheet":"Lease Doc DTI Output","index":19,"n_rows":32,"n_cols":2,"rows_kept":32,"cut":false,"hidden":true,"merged":[]}
["Prospector Number ",{"$f":"'Lease Doc Serviceability Calc'!B4","v":0}]
["Serviceability calculator type","Lease Doc"]
["Applicant 1 Normal Income",0]
["Applicant 2 Normal Income",0]
["Applicant 3 Normal Income",0]
["Applicant 4 Normal Income",0]
["Applicant 1 Rental Income",{"$f":"'Lease Doc Serviceability Calc'!D17","v":0}]
["Applicant 2 Rental Income",0]
["Applicant 3 Rental Income",0]
["Applicant 4 Rental Income",0]
{"$rows_left_out":23}
{"sheet":"Living Allow","index":20,"n_rows":96,"n_cols":14,"rows_kept":96,"cut":false,"hidden":true,"merged":[[2,4,2,6]]}
[]
[null,null,null,null,null,null,null,null,null,null,null,null,null,"Calculator Update Steps"]
[null,null,"Single","Joint","Living Allowance Calculation",null,null,null,null,null,null,null,1,"Copy and paste HEM data into HEM Tab"]
[null,null,null,null,null,null,null,null,null,null,null,null,2,"Adjust the formulas to that the VLOOKUP captures the band which includes $150,000 "]
[null,0,{"$f":"#REF!","v":{"$error":"#REF!"}},{"$f":"#REF!","v":{"$error":"#REF!"}},null,"$ per Week","$ per Month",null,null,null,null,null,3,"Copy data from Numbeo for Contry and Cost of Living index"]
[null,999,{"$f":"#REF!","v":{"$error":"#REF!"}},{"$f":"#REF!","v":{"$error":"#REF!"}},"Single",356.39,{"$f":"F6*52/12","v":1544.3566666666666},null,null,null,null,null,4,"Remove any countries with no Numbeo Cost of Living index value "]
[null,1499,{"$f":"#REF!","v":{"$error":"#REF!"}},{"$f":"#REF!","v":{"$error":"#REF!"}},"Couples",518.13,{"$f":"F7*52/12","v":2245.23},null,null,null,null,null,5,"Copy Australia Cost of Living Index value into F17 "]
[null,1999,{"$f":"#REF!","v":{"$error":"#REF!"}},{"$f":"#REF!","v":{"$error":"#REF!"}},"Children",489.48,{"$f":"(F8-F6)*52/12","v":576.72333333333347},null,null,null,null,null,6,"Update the Calculator Version date"]
[null,2499,{"$f":"#REF!","v":{"$error":"#REF!"}},{"$f":"#REF!","v":{"$error":"#REF!"}},null,null,null,null,null,null,null,null,7,"Update the HEM Data date"]
[null,2999,{"$f":"#REF!","v":{"$error":"#REF!"}},{"$f":"#REF!","v":{"$error":"#REF!"}},null,null,null,null,null,null,null,null,8,"Update the Cost of Living Data date"]
{"$rows_left_out":87}
{"sheet":"Tax Scales","index":21,"n_rows":175,"n_cols":55,"rows_kept":175,"cut":false,"hidden":true,"merged":[]}
["Annual Salary Guide - Standard",null,null,null,null,null,null,null,null,null,null,null,null,null,null,"Annual Salary Guide - SMSF",null,null,null,null,null,null,null,null,null,null,null,null,null,null,"Annual Salary Guide - Non Resident",null,null,null,null,null,null,null,null,null,null,null,null,null,null,"Annual Salary Guide - ICR"]
["Tax Scales ",null,null,null,null,null,null,null,null,null,null,null,null,null,null,"Tax Scales ",null,null,null,null,null,null,null,null,null,null,null,null,null,null,"Tax Scales ",null,null,null,null,null,null,null,null,null,null,null,null,null,null,"Tax Scales "]
["Applicant 1",null,null,null,null,null,null,null,null,null,null,null,null,null,null,"Applicant 1",null,null,null,null,null,null,null,null,null,null,null,null,null,null,"Applicant 1",null,null,null,null,null,null,null,null,null,null,null,null,null,null,"Applicant 1"]
["Gross Taxable Income",null,null,"Tax Rate",null,"Gross",null,"Tax",null,"Net",null,null,null,null,null,"Gross Taxable Income",null,null,"Tax Rate",null,"Gross",null,"Tax",null,"Net",null,"Flood Levy Calculations",null,null,null,"Gross Taxable Income",null,null,"Tax Rate",null,"Gross",null,"Tax",null,"Net",null,"Flood Levy Calculations",null,null,null,"Gross Taxable Income",null,null,"Tax Rate",null,"Gross",null,"Tax",null,"Net"]
[1,18200,{"$f":"B5-A5+1","v":18200},0,null,{"$f":"IF('Serviceability Calculator'!F32<B5,'Serviceability Calculator'!F32,C5)","v":0},{"$f":"F5","v":0},{"$f":"F5*D5","v":0},null,{"$f":"F5-H5","v":0},null,null,null,null,null,{"$f":"A5","v":1},18200,{"$f":"C5","v":18200},{"$f":"D5","v":0},null,{"$f":"IF('SMSF Serviceability Calculator'!E58<Q5,'SMSF Serviceability Calculator'!E58,R5)","v":0},{"$f":"U5","v":0},{"$f":"U5*S5","v":0},null,{"$f":"U5-W5","v":0},null,null,null,null,null,-1000000,0,0,0,null,{"$f":"IF('Non-Res Serviceability'!I32<AF5,'Non-Res Serviceability'!I32,AG5)","v":0},{"$f":"AJ5","v":0},{"$f":"AJ5*AH5","v":0},null,{"$f":"AJ5-AL5","v":0},null,null,null,null,null,{"$f":"A5","v":1},{"$f":"B5","v":18200},18200,0,null,{"$f":"IF('Commercial Calculator'!$F$65<AU5,'Commercial Calculator'!$F$65,AV5)","v":0},{"$f":"AY5","v":0},{"$f":"AY5*AW5","v":0},null,{"$f":"AY5-BA5","v":0}]
[18201,45000,{"$f":"B6-A6+1","v":26800},0.19,null,{"$f":"IF(G5='Serviceability Calculator'!F32,0,IF(('Serviceability Calculator'!F32-G5)>C6,C6,('Serviceability Calculator'!F32-G5)))","v":0},{"$f":"G5+F6","v":0},{"$f":"F6*D6","v":0},null,{"$f":"F6-H6","v":0},null,null,null,null,null,18201,45000,{"$f":"C6","v":26800},0.19,null,{"$f":"IF(V5='SMSF Serviceability Calculator'!$E$58,0,IF(('SMSF Serviceability Calculator'!$E$58-V5)>R6,R6,('SMSF Serviceability Calculator'!$E$58-V5)))","v":0},{"$f":"V5+U6","v":0},{"$f":"U6*S6","v":0},null,{"$f":"U6-W6","v":0},null,null,null,null,null,1,120000,{"$f":"AF6-AE6+1","v":120000},0.32500000000000001,null,{"$f":"IF(AK5='Non-Res Serviceability'!I32,0,IF(('Non-Res Serviceability'!I32-0)>AG6,AG6,('Non-Res Serviceability'!I32-0)))","v":0},{"$f":"AK5+AJ6","v":0},{"$f":"AJ6*AH6","v":0},null,{"$f":"AJ6-AL6","v":0},null,null,null,null,null,{"$f":"A6","v":18201},{"$f":"B6","v":45000},{"$f":"C6","v":26800},{"$f":"D6","v":0.19},null,{"$f":"IF(AZ5='Commercial Calculator'!$F$65,0,IF(('Commercial Calculator'!$F$65-AZ5)>AV6,AV6,('Commercial Calculator'!$F$65-AZ5)))","v":0},{"$f":"AZ5+AY6","v":0},{"$f":"AY6*AW6","v":0},null,{"$f":"AY6-BA6","v":0}]
[45001,120000,{"$f":"B7-A7+1","v":75000},0.32500000000000001,null,{"$f":"IF(G6='Serviceability Calculator'!F32,0,IF(('Serviceability Calculator'!F32-G6)>C7,C7,('Serviceability Calculator'!F32-G6)))","v":0},{"$f":"G6+F7","v":0},{"$f":"F7*D7","v":0},null,{"$f":"F7-H7","v":0},null,null,null,null,null,45001,120000,75000,0.32500000000000001,null,{"$f":"IF(V6='SMSF Serviceability Calculator'!$E$58,0,IF(('SMSF Serviceability Calculator'!$E$58-V6)>R7,R7,('SMSF Serviceability Calculator'!$E$58-V6)))","v":0},{"$f":"V6+U7","v":0},{"$f":"U7*S7","v":0},null,{"$f":"U7-W7","v":0},null,{"$f":"IF(U7>13000,(U7-13000)*0.5%,0)","v":0},null,null,null,120001,180000,{"$f":"AF7-AE7+1","v":60000},0.37,null,{"$f":"IF(AK6='Non-Res Serviceability'!I32,0,IF(('Non-Res Serviceability'!I32-AK6)>AG7,AG7,('Non-Res Serviceability'!I32-AK6)))","v":0},{"$f":"AK6+AJ7","v":0},{"$f":"AJ7*AH7","v":0},null,{"$f":"AJ7-AL7","v":0},null,{"$f":"IF(AJ7>13000,(AJ7-13000)*0.5%,0)","v":0},null,null,null,45001,120000,75000,0.32500000000000001,null,{"$f":"IF(AZ6='Commercial Calculator'!$F$65,0,IF(('Commercial Calculator'!$F$65-AZ6)>AV7,AV7,('Commercial Calculator'!$F$65-AZ6)))","v":0},{"$f":"AZ6+AY7","v":0},{"$f":"AY7*AW7","v":0},null,{"$f":"AY7-BA7","v":0}]
[120001,180000,{"$f":"B8-A8+1","v":60000},0.37,null,{"$f":"IF(G7='Serviceability Calculator'!F32,0,IF(('Serviceability Calculator'!F32-G7)>C8,C8,('Serviceability Calculator'!F32-G7)))","v":0},{"$f":"G7+F8","v":0},{"$f":"F8*D8","v":0},null,{"$f":"F8-H8","v":0},null,null,null,null,null,120001,180000,60000,0.37,null,{"$f":"IF(V7='SMSF Serviceability Calculator'!$E$58,0,IF(('SMSF Serviceability Calculator'!$E$58-V7)>R8,R8,('SMSF Serviceability Calculator'!$E$58-V7)))","v":0},{"$f":"V7+U8","v":0},{"$f":"U8*S8","v":0},null,{"$f":"U8-W8","v":0},null,{"$f":"SUM(AB8:AC8)","v":0},{"$f":"IF(U8<=20000,U8*0.5%,0)","v":0},{"$f":"IF(U8>20000,((U8-20000)*1%)+100,0)","v":0},null,180001,10000000,{"$f":"AF8-AE8+1","v":9820000},0.45,null,{"$f":"IF(AK7='Non-Res Serviceability'!I32,0,IF(('Non-Res Serviceability'!I32-AK7)>AG8,AG8,('Non-Res Serviceability'!I32-AK7)))","v":0},{"$f":"AK7+AJ8","v":0},{"$f":"AJ8*AH8","v":0},null,{"$f":"AJ8-AL8","v":0},null,{"$f":"SUM(AQ8:AR8)","v":0},{"$f":"IF(AJ8<=20000,AJ8*0.5%,0)","v":0},{"$f":"IF(AJ8>20000,((AJ8-20000)*1%)+100,0)","v":0},null,120001,180000,60000,0.37,null,{"$f":"IF(AZ7='Commercial Calculator'!$F$65,0,IF(('Commercial Calculator'!$F$65-AZ7)>AV8,AV8,('Commercial Calculator'!$F$65-AZ7)))","v":0},{"$f":"AZ7+AY8","v":0},{"$f":"AY8*AW8","v":0},null,{"$f":"AY8-BA8","v":0}]
[180001,100000000,{"$f":"B9-A9+1","v":99820000},0.45,null,{"$f":"IF('Serviceability Calculator'!F32-G8<=0,0,('Serviceability Calculator'!F32-G8))","v":0},{"$f":"G8+F9","v":0},{"$f":"F9*D9","v":0},null,{"$f":"F9-H9","v":0},null,null,null,null,null,180001,100000000,99820000,0.45,null,{"$f":"IF(V8='SMSF Serviceability Calculator'!$E$58,0,IF(('SMSF Serviceability Calculator'!$E$58-V8)>R9,R9,('SMSF Serviceability Calculator'!$E$58-V8)))","v":0},{"$f":"V8+U9","v":0},{"$f":"U9*S9","v":0},null,{"$f":"U9-W9","v":0},null,{"$f":"U9*1%","v":0},null,null,null,10000001,20000000,{"$f":"AF9-AE9+1","v":10000000},0.45,null,{"$f":"IF('Non-Res Serviceability'!I32-AK8<=0,0,('Non-Res Serviceability'!I32-AK8))","v":0},{"$f":"AK8+AJ9","v":0},{"$f":"AJ9*AH9","v":0},null,{"$f":"AJ9-AL9","v":0},null,{"$f":"AJ9*1%","v":0},null,null,null,180001,100000000,99820000,0.45,null,{"$f":"IF(AZ8='Commercial Calculator'!$F$65,0,IF(('Commercial Calculator'!$F$65-AZ8)>AV9,AV9,('Commercial Calculator'!$F$65-AZ8)))","v":0},{"$f":"AZ8+AY9","v":0},{"$f":"AY9*AW9","v":0},null,{"$f":"AY9-BA9","v":0}]
[null,null,null,"Totals:",null,{"$f":"SUM(F5:F9)","v":0},null,{"$f":"SUM(H5:H9)","v":0},null,{"$f":"SUM(J5:J9)","v":0},null,null,null,null,null,null,null,null,"Totals:",null,{"$f":"SUM(U5:U9)","v":0},null,{"$f":"SUM(W5:W9)","v":0},null,{"$f":"SUM(Y5:Y9)","v":0},null,{"$f":"SUM(AA7:AA9)","v":0},null,null,null,null,null,null,"Totals:",null,{"$f":"IF('Non-Res Serviceability'!$I$32<0,SUM(AJ5:AJ9),SUM(AJ6:AJ9))","v":0},null,{"$f":"SUM(AL5:AL9)","v":0},null,{"$f":"SUM(AN5:AN9)","v":0},null,{"$f":"SUM(AP7:AP9)","v":0},null,null,null,null,null,null,"Totals:",null,{"$f":"SUM(AY5:AY9)","v":0},null,{"$f":"SUM(BA5:BA9)","v":0},null,{"$f":"SUM(BC5:BC9)","v":0}]
{"$rows_left_out":166}
{"sheet":"Definitions","index":22,"n_rows":50,"n_cols":2,"rows_kept":50,"cut":false,"hidden":true,"merged":[]}
[]
[]
[]
["Definitions"]
[]
["Household Number","The household group that an individual applicant is attached to."]
[]
["Status","Individual applicants household status (single or couple)"]
[]
["Dependents","Number of children or other dependents of an individual applicant. Dependents includes adult children over 18 if they rely on parents to cover living costs. Dependents also includes dependent children or other parties over 18 such as children with disabilities."]
{"$rows_left_out":41}
{"sheet":"Admin","index":23,"n_rows":44,"n_cols":13,"rows_kept":44,"cut":false,"hidden":true,"merged":[[43,12,43,25],[18,12,18,25],[19,12,19,25],[36,12,36,25],[37,12,37,25],[42,12,42,25]]}
[]
[]
[]
[]
[]
[]
[]
[]
[]
[]
{"$rows_left_out":35}
{"sheet":"RepayCalculator","index":24,"n_rows":51,"n_cols":8,"rows_kept":51,"cut":false,"hidden":true,"merged":[]}
["Dropdown box data"]
["Principal & Interest"]
["Interest Only"]
[]
[]
["Serviceability Sensitivity",2.5000000000000001E-2]
["Serviceability Sensitivity - SMSF",0.02]
[]
["Interest Rate Floor",5.2999999999999999E-2]
[]
{"$rows_left_out":41}